{"text_format":"1","workbook":"xlsx","n_sheets":10,"sheets":["Contact Information","Background","Narrative","Budget Details & Amendments","Budget Roll-Up","Project Roll_Up","Improvement Plan","Program Assurances","Perkins Quarterly Report","List"],"not_rendered":{"charts":0,"images":1,"macros":0,"external_links":0,"defined_names":2,"comments":0,"pivot_tables":0},"unopened":[],"bounds":{"document_bytes":16777216,"sheet_cells":100000,"rows_first":2000,"rows_last":500,"rows_between":2000,"halvings":0,"cell_chars":16384,"cell_head_chars":4096},"cells_cut":0,"cells_raw":0,"read":"whole","date_system":"1900"}

{"sheet":"Contact Information","index":0,"n_rows":67,"n_cols":8,"rows_kept":67,"cut":false,"hidden":false,"merged":[[14,0,14,4],[14,5,14,8],[4,0,4,5],[5,0,5,2],[6,0,6,4],[8,0,8,3],[10,2,10,5],[45,0,45,8],[17,0,17,8],[20,0,20,3],[20,5,20,6],[23,4,23,5],[26,0,26,5],[30,0,30,4],[30,5,30,8],[33,0,33,8],[36,0,36,3],[36,5,36,6],[39,4,39,5],[42,0,42,5],[62,1,62,5],[62,6,62,9],[47,0,47,4],[47,5,47,8],[50,4,50,5],[53,0,53,5],[59,1,59,5],[59,6,59,9],[66,1,66,5],[66,6,66,9],[23,0,23,2],[39,0,39,2],[50,0,50,2],[56,0,57,9],[63,1,63,5],[63,6,63,9],[64,1,64,5],[64,6,64,9],[65,1,65,5],[65,6,65,9],[60,1,60,5],[60,6,60,9],[61,1,61,5],[61,6,61,9]]}
["Perkins Postsecondary Local Application 2025-26"]
[]
["Program: Strengthening Career and Technical Education for the 21st Century Act"]
[]
["Perkins Program Manager: ML Rutherford"]
["Phone: 406-449-9128"]
{"$rows_left_out":62}
{"sheet":"Background","index":1,"n_rows":18,"n_cols":1,"rows_kept":18,"cut":false,"hidden":false,"merged":[]}
["1. Please provide a brief summary of the results of your Comprehensive Local Needs Assessment and what CTE course offerings and/or activities you will be targeting in this application. Be sure to include how the results of the CLNA informed the selection of the specific career and technical education programs and activities selected to be funded and a description of any new programs of study you plan to develop and submit to the State for approval based on CLNA findings."]
["The CLNA indicates that there is a shortage of qualified mechanics who have modern auto frame realignment training. It also shows that one of the major skills our nursing graduates do not have when entering the workforce is how to use a modern Medication Dispensing Cart that is in all hospitals today. From these findings, we will be focusing on training our auto mechanic students in how to operate a modern realignment machine, which we will also make available through a new microcredential to former students for updated training. The nursing division will also be trained on a modern Medication Dispensing Cart, which will make them more competitive and prepared for the workforce."]
["2. Please provide a brief description of how your campus will, in collaboration with local workforce development partners, provide a series of career exploration and career guidance activities including: (A) career exploration and career development coursework, activities, or services; (B) career information on employment opportunities that incorporate the most up-to-date information on high skill, high-wage, or in-demand industry sectors or occupations, as determined by the CLNA; and (C) an organized system of career guidance and academic counseling to students before enrolling and while participating in a career and technical education programs."]
["A. With a modern realignment machine, the college will be able to train its auto mechanic students in how to run such a machine in the field. The college is also planning to offer a microcredential in realignment to community members who are already in the automotive repair industry, as well as alumni from the automotive program. \nFor the nursing program, the medication dispensing cart will fill a much-needed skill set that our students are currently not getting at the college, and must be trained at the hospital, where students either do their clinicals or when they are hired. Having these skills before their clinicals makes them more valuable as potential employees. \nB. Currently, a trained alignment technician earns $43,334 a year. Rosebud and Custer Counties have a dire need for these alignment technicians in car dealerships, tire stores such as Tire Rama and Les Swabs. \nNurses in Custer County and neighboring counties are still in high demand, earning $70,000 a year or more. \nC. Both the auto mechanic and nursing programs have career and academic counseling in place. \n"]
["3. Please provide a brief description of how your campus will improve the academic and technical skills of students participating in CTE programs."]
["With the help of Perkins Grant Funding, the college plans on purchasing a realignment machine, which the auto mechanic program currently lacks, and purchasing a medication dispensing cart, which the nursing program currently lacks as well.  Both these purchases will greatly improve the chances of getting hired in the community. "]
{"$rows_left_out":13}
{"sheet":"Narrative","index":2,"n_rows":1455,"n_cols":9,"rows_kept":1455,"cut":false,"hidden":false,"merged":[[5,0,5,9],[6,0,6,9],[7,0,16,9],[17,0,17,9],[18,0,18,9],[19,0,23,9],[0,0,0,9],[1,0,1,9],[2,0,2,1],[2,2,2,9],[3,0,3,9],[4,0,4,2],[4,5,4,7],[48,0,48,9],[49,0,49,9],[50,0,50,9],[51,0,51,1],[51,2,51,9],[52,0,52,9],[24,0,24,9],[32,0,32,9],[36,0,47,9],[33,0,35,9],[25,0,25,9],[26,0,30,9],[31,0,31,9],[82,0,84,9],[67,0,67,9],[68,0,72,9],[73,0,73,9],[74,0,74,9],[81,0,81,9],[53,0,53,2],[53,5,53,7],[54,0,54,9],[55,0,55,9],[56,0,65,9],[66,0,66,9],[75,0,79,9],[80,0,80,9],[131,0,133,9],[97,0,97,9],[98,0,98,9],[85,0,96,9],[99,0,99,9],[100,0,100,1],[100,2,100,9],[101,0,101,9],[102,0,102,2],[102,5,102,7],[103,0,103,9],[104,0,104,9],[116,0,116,9],[105,0,114,9],[115,0,115,9],[117,0,121,9],[122,0,122,9],[123,0,123,9],[124,0,128,9],[129,0,129,9],[130,0,130,9],[180,0,182,9],[152,0,152,9],[153,0,153,9],[134,0,145,9],[146,0,146,9],[147,0,147,9],[148,0,148,9],[149,0,149,1],[149,2,149,9],[150,0,150,9],[151,0,151,2],[151,5,151,7],[178,0,178,9],[179,0,179,9],[154,0,163,9],[164,0,164,9],[165,0,165,9],[166,0,170,9],[171,0,171,9],[172,0,172,9],[173,0,177,9],[183,0,194,9],[197,0,197,9],[198,0,198,1],[198,2,198,9],[199,0,199,9],[200,0,200,2],[200,5,200,7],[201,0,201,9],[203,0,212,9],[227,0,227,9],[220,0,220,9],[221,0,221,9],[222,0,226,9],[228,0,228,9],[229,0,231,9],[202,0,202,9],[195,0,195,9],[196,0,196,9],[213,0,213,9],[214,0,214,9],[215,0,219,9],[263,0,263,9],[245,0,245,9],[246,0,246,9],[232,0,243,9],[244,0,244,9],[247,0,247,1],[247,2,247,9],[248,0,248,9],[249,0,249,2],[249,5,249,7],[250,0,250,9],[251,0,251,9],[252,0,261,9],[262,0,262,9],[301,0,310,9],[311,0,311,9],[269,0,269,9],[270,0,270,9],[264,0,268,9],[271,0,275,9],[276,0,276,9],[277,0,277,9],[278,0,280,9],[281,0,292,9],[396,0,396,2],[396,5,396,7],[367,0,367,9],[368,0,368,9],[369,0,373,9],[349,0,349,9],[325,0,325,9],[313,0,317,9],[318,0,318,9],[319,0,319,9],[320,0,324,9],[326,0,326,9],[327,0,329,9],[330,0,341,9],[342,0,342,9],[343,0,343,9],[344,0,344,9],[345,0,345,1],[345,2,345,9],[392,0,392,9],[393,0,393,9],[374,0,374,9],[375,0,375,9],[379,0,390,9],[391,0,391,9],[394,0,394,1],[394,2,394,9],[395,0,395,9],[293,0,293,9],[294,0,294,9],[295,0,295,9],[296,0,296,1],[296,2,296,9],[297,0,297,9],[298,0,298,2],[298,5,298,7],[299,0,299,9],[346,0,346,9],[347,0,347,2],[347,5,347,7],[348,0,348,9],[350,0,359,9],[360,0,360,9],[361,0,361,9],[362,0,366,9],[376,0,378,9],[312,0,312,9],[300,0,300,9],[397,0,397,9],[399,0,408,9],[409,0,409,9],[411,0,415,9],[416,0,416,9],[418,0,422,9],[423,0,423,9],[424,0,424,9],[425,0,427,9],[417,0,417,9],[398,0,398,9],[410,0,410,9],[428,0,439,9],[440,0,440,9],[441,0,441,9],[442,0,442,9],[443,0,443,1],[443,2,443,9],[444,0,444,9],[445,0,445,2],[445,5,445,7],[446,0,446,9],[447,0,447,9],[448,0,457,9],[458,0,458,9],[459,0,459,9],[460,0,464,9],[465,0,465,9],[466,0,466,9],[467,0,471,9],[472,0,472,9],[473,0,473,9],[474,0,476,9],[477,0,488,9],[489,0,489,9],[490,0,490,9],[491,0,491,9],[492,0,492,1],[492,2,492,9],[493,0,493,9],[494,0,494,2],[494,5,494,7],[495,0,495,9],[496,0,496,9],[497,0,506,9],[507,0,507,9],[508,0,508,9],[509,0,513,9],[514,0,514,9],[515,0,515,9],[516,0,520,9],[521,0,521,9],[522,0,522,9],[523,0,525,9],[526,0,537,9],[538,0,538,9],[539,0,539,9],[540,0,540,9],[541,0,541,1],[541,2,541,9],[542,0,542,9],[543,0,543,2],[543,5,543,7],[544,0,544,9],[545,0,545,9],[546,0,555,9],[556,0,556,9],[557,0,557,9],[558,0,562,9],[563,0,563,9],[564,0,564,9],[565,0,569,9],[570,0,570,9],[571,0,571,9],[572,0,574,9],[575,0,586,9],[587,0,587,9],[588,0,588,9],[589,0,589,9],[590,0,590,1],[590,2,590,9],[591,0,591,9],[592,0,592,2],[592,5,592,7],[593,0,593,9],[594,0,594,9],[595,0,604,9],[605,0,605,9],[606,0,606,9],[607,0,611,9],[612,0,612,9],[613,0,613,9],[614,0,618,9],[619,0,619,9],[620,0,620,9],[621,0,623,9],[624,0,635,9],[636,0,636,9],[637,0,637,9],[638,0,638,9],[639,0,639,1],[639,2,639,9],[640,0,640,9],[641,0,641,2],[641,5,641,7],[642,0,642,9],[643,0,643,9],[644,0,653,9],[654,0,654,9],[655,0,655,9],[656,0,660,9],[661,0,661,9],[662,0,662,9],[663,0,667,9],[668,0,668,9],[669,0,669,9],[670,0,672,9],[673,0,684,9],[685,0,685,9],[686,0,686,9],[687,0,687,9],[688,0,688,1],[688,2,688,9],[689,0,689,9],[690,0,690,2],[690,5,690,7],[691,0,691,9],[692,0,692,9],[693,0,702,9],[703,0,703,9],[704,0,704,9],[705,0,709,9],[710,0,710,9],[711,0,711,9],[712,0,716,9],[717,0,717,9],[718,0,718,9],[719,0,721,9],[722,0,733,9],[734,0,734,9],[735,0,735,9],[736,0,736,9],[737,0,737,1],[737,2,737,9],[738,0,738,9],[739,0,739,2],[739,5,739,7],[740,0,740,9],[741,0,741,9],[742,0,751,9],[752,0,752,9],[753,0,753,9],[754,0,758,9],[759,0,759,9],[760,0,760,9],[761,0,765,9],[766,0,766,9],[767,0,767,9],[768,0,770,9],[771,0,782,9],[783,0,783,9],[784,0,784,9],[785,0,785,9],[786,0,786,1],[786,2,786,9],[787,0,787,9],[788,0,788,2],[788,5,788,7],[789,0,789,9],[790,0,790,9],[791,0,800,9],[801,0,801,9],[802,0,802,9],[803,0,807,9],[808,0,808,9],[809,0,809,9],[810,0,814,9],[815,0,815,9],[816,0,816,9],[817,0,819,9],[820,0,831,9],[832,0,832,9],[833,0,833,9],[834,0,834,9],[835,0,835,1],[835,2,835,9],[836,0,836,9],[837,0,837,2],[837,5,837,7],[838,0,838,9],[839,0,839,9],[840,0,849,9],[850,0,850,9],[851,0,851,9],[852,0,856,9],[857,0,857,9],[858,0,858,9],[859,0,863,9],[864,0,864,9],[865,0,865,9],[866,0,868,9],[869,0,880,9],[881,0,881,9],[882,0,882,9],[883,0,883,9],[884,0,884,1],[884,2,884,9],[885,0,885,9],[886,0,886,2],[886,5,886,7],[887,0,887,9],[888,0,888,9],[889,0,898,9],[899,0,899,9],[900,0,900,9],[901,0,905,9],[906,0,906,9],[907,0,907,9],[908,0,912,9],[913,0,913,9],[914,0,914,9],[915,0,917,9],[918,0,929,9],[930,0,930,9],[931,0,931,9],[932,0,932,9],[933,0,933,1],[933,2,933,9],[934,0,934,9],[935,0,935,2],[935,5,935,7],[936,0,936,9],[937,0,937,9],[938,0,947,9],[948,0,948,9],[949,0,949,9],[950,0,954,9],[955,0,955,9],[956,0,956,9],[957,0,961,9],[962,0,962,9],[963,0,963,9],[964,0,966,9],[967,0,978,9],[979,0,979,9],[980,0,980,9],[981,0,981,9],[982,0,982,1],[982,2,982,9],[983,0,983,9],[984,0,984,2],[984,5,984,7],[985,0,985,9],[986,0,986,9],[987,0,996,9],[997,0,997,9],[998,0,998,9],[999,0,1003,9],[1004,0,1004,9],[1005,0,1005,9],[1006,0,1010,9],[1011,0,1011,9],[1012,0,1012,9],[1013,0,1015,9],[1016,0,1027,9],[1028,0,1028,9],[1029,0,1029,9],[1030,0,1030,9],[1031,0,1031,1],[1031,2,1031,9],[1032,0,1032,9],[1033,0,1033,2],[1033,5,1033,7],[1034,0,1034,9],[1035,0,1035,9],[1036,0,1045,9],[1046,0,1046,9],[1047,0,1047,9],[1048,0,1052,9],[1053,0,1053,9],[1054,0,1054,9],[1055,0,1059,9],[1060,0,1060,9],[1061,0,1061,9],[1062,0,1064,9],[1065,0,1076,9],[1077,0,1077,9],[1078,0,1078,9],[1079,0,1079,9],[1080,0,1080,1],[1080,2,1080,9],[1081,0,1081,9],[1082,0,1082,2],[1082,5,1082,7],[1083,0,1083,9],[1084,0,1084,9],[1085,0,1094,9],[1095,0,1095,9],[1096,0,1096,9],[1097,0,1101,9],[1102,0,1102,9],[1103,0,1103,9],[1104,0,1108,9],[1109,0,1109,9],[1110,0,1110,9],[1111,0,1113,9],[1114,0,1125,9],[1126,0,1126,9],[1127,0,1127,9],[1128,0,1128,9],[1129,0,1129,1],[1129,2,1129,9],[1130,0,1130,9],[1131,0,1131,2],[1131,5,1131,7],[1132,0,1132,9],[1133,0,1133,9],[1134,0,1143,9],[1144,0,1144,9],[1145,0,1145,9],[1146,0,1150,9],[1151,0,1151,9],[1152,0,1152,9],[1153,0,1157,9],[1158,0,1158,9],[1159,0,1159,9],[1160,0,1162,9],[1163,0,1174,9],[1175,0,1175,9],[1176,0,1176,9],[1177,0,1177,9],[1178,0,1178,1],[1178,2,1178,9],[1179,0,1179,9],[1180,0,1180,2],[1180,5,1180,7],[1181,0,1181,9],[1182,0,1182,9],[1183,0,1192,9],[1193,0,1193,9],[1194,0,1194,9],[1195,0,1199,9],[1200,0,1200,9],[1201,0,1201,9],[1202,0,1206,9],[1207,0,1207,9],[1208,0,1208,9],[1209,0,1211,9],[1212,0,1223,9],[1224,0,1224,9],[1225,0,1225,9],[1226,0,1226,9],[1227,0,1227,1],[1227,2,1227,9],[1228,0,1228,9],[1229,0,1229,2],[1229,5,1229,7],[1230,0,1230,9],[1231,0,1231,9],[1232,0,1241,9],[1242,0,1242,9],[1243,0,1243,9],[1244,0,1248,9],[1249,0,1249,9],[1250,0,1250,9],[1251,0,1255,9],[1256,0,1256,9],[1257,0,1257,9],[1258,0,1260,9],[1261,0,1272,9],[1273,0,1273,9],[1274,0,1274,9],[1275,0,1275,9],[1276,0,1276,1],[1276,2,1276,9],[1277,0,1277,9],[1278,0,1278,2],[1278,5,1278,7],[1279,0,1279,9],[1280,0,1280,9],[1281,0,1290,9],[1291,0,1291,9],[1292,0,1292,9],[1293,0,1297,9],[1298,0,1298,9],[1299,0,1299,9],[1300,0,1304,9],[1305,0,1305,9],[1306,0,1306,9],[1307,0,1309,9],[1310,0,1321,9],[1322,0,1322,9],[1323,0,1323,9],[1324,0,1324,9],[1325,0,1325,1],[1325,2,1325,9],[1326,0,1326,9],[1327,0,1327,2],[1327,5,1327,7],[1328,0,1328,9],[1329,0,1329,9],[1330,0,1339,9],[1340,0,1340,9],[1341,0,1341,9],[1342,0,1346,9],[1347,0,1347,9],[1348,0,1348,9],[1349,0,1353,9],[1354,0,1354,9],[1355,0,1355,9],[1356,0,1358,9],[1359,0,1370,9],[1371,0,1371,9],[1372,0,1372,9],[1373,0,1373,9],[1374,0,1374,1],[1374,2,1374,9],[1375,0,1375,9],[1376,0,1376,2],[1376,5,1376,7],[1377,0,1377,9],[1378,0,1378,9],[1379,0,1388,9],[1389,0,1389,9],[1390,0,1390,9],[1391,0,1395,9],[1396,0,1396,9],[1397,0,1397,9],[1398,0,1402,9],[1403,0,1403,9],[1404,0,1404,9],[1405,0,1407,9],[1408,0,1419,9],[1420,0,1420,9],[1421,0,1421,9],[1422,0,1422,9],[1423,0,1423,1],[1423,2,1423,9],[1424,0,1424,9],[1425,0,1425,2],[1425,5,1425,7],[1426,0,1426,9],[1427,0,1427,9],[1428,0,1437,9],[1457,0,1468,9],[1469,0,1469,9],[1438,0,1438,9],[1439,0,1439,9],[1440,0,1444,9],[1445,0,1445,9],[1446,0,1446,9],[1447,0,1451,9],[1452,0,1452,9],[1453,0,1453,9],[1454,0,1456,9]]}
["Project/Program Purchase #1"]
[]
["Project Title:",null,"Automotive Mechanics Program – Four Wheel Alignment Machine"]
[]
["Begin Quarter: (Please select):",null,null,"Quarter 1",null,"End Quarter: (Please select):",null,null,"Quarter 2"]
[]
{"$rows_left_out":1450}
{"sheet":"Budget Details & Amendments","index":3,"n_rows":146,"n_cols":23,"rows_kept":146,"cut":false,"hidden":false,"merged":[[21,1,21,12],[93,1,93,12],[84,1,84,12],[85,1,85,12],[57,1,57,12],[64,1,64,12],[65,1,65,12],[66,1,66,12],[67,1,67,12],[63,0,63,12],[79,1,79,12],[80,1,80,12],[81,1,81,12],[82,1,82,12],[83,1,83,12],[37,1,37,12],[27,1,27,12],[26,1,26,12],[22,1,22,12],[50,1,50,12],[51,1,51,12],[49,1,49,12],[86,1,86,12],[87,1,87,12],[2,0,2,13],[18,0,18,12],[55,1,55,12],[56,1,56,12],[52,1,52,12],[53,1,53,12],[54,1,54,12],[0,3,0,5],[7,0,7,8],[5,0,5,4],[12,0,15,13],[28,1,28,12],[29,1,29,12],[47,1,47,12],[38,1,38,12],[39,1,39,12],[40,1,40,12],[41,1,41,12],[46,0,46,12],[19,1,19,12],[20,1,20,12],[25,1,25,12],[23,1,23,12],[24,1,24,12],[115,1,115,12],[106,1,106,12],[92,1,92,12],[94,1,94,12],[95,1,95,12],[96,1,96,12],[98,1,98,12],[91,1,91,12],[111,1,111,12],[113,1,113,12],[114,1,114,12],[102,1,102,12],[97,1,97,12],[88,1,88,12],[78,1,78,12],[136,1,136,12],[137,1,137,12],[116,1,116,12],[127,1,127,12],[126,0,126,12],[68,1,68,12],[71,1,71,12],[72,1,72,12],[73,1,73,12],[74,1,74,12],[128,1,128,12],[129,1,129,12],[130,1,130,12],[131,1,131,12],[107,1,107,12],[108,1,108,12],[109,1,109,12],[110,1,110,12],[132,1,132,12],[133,1,133,12],[134,1,134,12],[135,1,135,12],[9,12,9,13],[142,15,142,16],[142,18,142,19],[142,21,142,22],[143,15,145,16],[143,18,145,19],[143,21,145,22],[112,1,112,12],[17,0,17,22],[62,0,62,22],[42,1,42,12],[43,1,43,12],[69,1,69,12],[70,1,70,12],[77,0,77,12],[105,0,105,12],[32,0,32,12],[33,1,33,12],[34,1,34,12],[35,1,35,12],[36,1,36,12],[99,1,99,12],[100,1,100,12],[101,1,101,12]]}
["Grant Amount Requested:",null,null,55164]
[]
["Administrative Costs:"]
["Federal Guidelines state that no more than 5% of direct costs (excluding major equipment) can go to administration and indirect costs."]
[]
[" The maximum allowed for the institution is:",null,null,null,null,{"$f":"D1/1.05*0.05","v":2627}]
{"$rows_left_out":141}
{"sheet":"Budget Roll-Up","index":4,"n_rows":26,"n_cols":15,"rows_kept":26,"cut":false,"hidden":false,"merged":[[0,0,0,2],[0,4,0,6],[0,8,0,10],[0,12,0,14],[1,0,1,1],[1,4,1,5],[1,8,1,9],[1,12,1,13],[25,0,25,6],[2,0,2,1],[2,4,2,5],[2,8,2,9],[2,12,2,13],[8,0,8,1],[8,4,8,5],[8,8,8,9],[8,12,8,13]]}
["Original Budget (Do not edit)",null,null,null,"Amendment #1",null,null,null,"Amendment #2",null,null,null,"Amendment #3"]
["Expenditure Items:",null,"Amount",null,"Expenditure Items:",null,"Amount",null,"Expenditure Items:",null,"Amount",null,"Expenditure Items:",null,"Amount"]
["Personal Services",null,null,null,"Personnel Services",null,null,null,"Personnel Services",null,null,null,"Personnel Services"]
["01","Salaries",{"$f":"'Budget Details & Amendments'!N31","v":0},null,"01","Salaries",{"$f":"'Budget Details & Amendments'!P31","v":0},null,"01","Salaries",{"$f":"'Budget Details & Amendments'!S31","v":0},null,"01","Salaries",{"$f":"'Budget Details & Amendments'!V31","v":0}]
["02","Hourly Wages",{"$f":"'Budget Details & Amendments'!N45","v":0},null,"02","Hourly Wages",{"$f":"'Budget Details & Amendments'!P45","v":0},null,"02","Hourly Wages",{"$f":"'Budget Details & Amendments'!S45","v":0},null,"02","Hourly Wages",{"$f":"'Budget Details & Amendments'!V45","v":0}]
["03","Employee Benefits",{"$f":"'Budget Details & Amendments'!N59","v":0},null,"03","Employee Benefits",{"$f":"'Budget Details & Amendments'!P59","v":0},null,"03","Employee Benefits",{"$f":"'Budget Details & Amendments'!S59","v":0},null,"03","Employee Benefits",{"$f":"'Budget Details & Amendments'!V59","v":0}]
{"$rows_left_out":21}
{"sheet":"Project Roll_Up","index":5,"n_rows":32,"n_cols":10,"rows_kept":32,"cut":false,"hidden":false,"merged":[]}
[null,null,null,"Original Budget",null,"Amendment #1",null,"Amendment #2",null,"Amendment #3"]
[]
["Budget for Project #1",{"$f":"Narrative!C3","v":"Automotive Mechanics Program – Four Wheel Alignment Machine"},null,{"$f":"SUMIF('Budget Details & Amendments'!$A$21:$A$138,1,'Budget Details & Amendments'!$N$21:$N$138)","v":40831.870000000003},null,{"$f":"SUMIF('Budget Details & Amendments'!$A$21:$A$138,1,'Budget Details & Amendments'!$P$21:$P$138)","v":40831.870000000003},null,{"$f":"SUMIF('Budget Details & Amendments'!$A$21:$A$138,1,'Budget Details & Amendments'!$S$21:$S$138)","v":40831.870000000003},null,{"$f":"SUMIF('Budget Details & Amendments'!$A$21:$A$138,1,'Budget Details & Amendments'!$V$21:$V$138)","v":40831.870000000003}]
["Budget for Project #2",{"$f":"Narrative!C52","v":"Medication Dispensing Cart"},null,{"$f":"SUMIF('Budget Details & Amendments'!$A$21:$A$138,2,'Budget Details & Amendments'!$N$21:$N$138)","v":14332.56},null,{"$f":"SUMIF('Budget Details & Amendments'!$A$21:$A$138,2,'Budget Details & Amendments'!$P$21:$P$138)","v":14332.56},null,{"$f":"SUMIF('Budget Details & Amendments'!$A$21:$A$138,2,'Budget Details & Amendments'!$S$21:$S$138)","v":14332.56},null,{"$f":"SUMIF('Budget Details & Amendments'!$A$21:$A$138,2,'Budget Details & Amendments'!$V$21:$V$138)","v":14332.56}]
["Budget for Project #3",{"$f":"Narrative!C101","v":0},null,{"$f":"SUMIF('Budget Details & Amendments'!$A$21:$A$138,3,'Budget Details & Amendments'!$N$21:$N$138)","v":0},null,{"$f":"SUMIF('Budget Details & Amendments'!$A$21:$A$138,3,'Budget Details & Amendments'!$P$21:$P$138)","v":0},null,{"$f":"SUMIF('Budget Details & Amendments'!$A$21:$A$138,3,'Budget Details & Amendments'!$S$21:$S$138)","v":0},null,{"$f":"SUMIF('Budget Details & Amendments'!$A$21:$A$138,3,'Budget Details & Amendments'!$V$21:$V$138)","v":0}]
["Budget for Project #4",{"$f":"Narrative!C150","v":0},null,{"$f":"SUMIF('Budget Details & Amendments'!$A$21:$A$138,4,'Budget Details & Amendments'!$N$21:$N$138)","v":0},null,{"$f":"SUMIF('Budget Details & Amendments'!$A$21:$A$138,4,'Budget Details & Amendments'!$P$21:$P$138)","v":0},null,{"$f":"SUMIF('Budget Details & Amendments'!$A$21:$A$138,4,'Budget Details & Amendments'!$S$21:$S$138)","v":0},null,{"$f":"SUMIF('Budget Details & Amendments'!$A$21:$A$138,4,'Budget Details & Amendments'!$V$21:$V$138)","v":0}]
{"$rows_left_out":27}
{"sheet":"Improvement Plan","index":6,"n_rows":39,"n_cols":1,"rows_kept":39,"cut":false,"hidden":false,"merged":[[20,0,20,3],[0,0,0,7],[2,0,2,3],[3,0,9,8],[11,0,11,5],[12,0,18,8],[21,0,27,8],[29,0,29,5],[30,0,36,8],[38,0,38,7],[39,0,45,8]]}
["Please complete this section only if OCHE has requested your campus to do so "]
[]
["Improvement Plan Goals:"]
[]
[]
[]
{"$rows_left_out":34}
{"sheet":"Program Assurances","index":7,"n_rows":64,"n_cols":8,"rows_kept":64,"cut":false,"hidden":false,"merged":[[61,4,61,8],[59,7,59,8],[63,4,63,8],[11,0,54,8],[9,0,9,8],[56,0,57,8],[59,1,59,5]]}
[]
[]
[]
[]
[]
[]
{"$rows_left_out":59}
{"sheet":"Perkins Quarterly Report","index":8,"n_rows":56,"n_cols":10,"rows_kept":56,"cut":false,"hidden":false,"merged":[[0,0,0,9],[1,0,1,9],[2,0,2,9],[4,2,4,3],[5,2,5,3],[5,5,5,6],[55,0,55,1],[6,2,6,3],[7,2,7,3],[9,0,9,1],[10,0,10,1],[16,0,16,1],[34,0,38,9],[40,0,47,9],[50,0,50,1],[50,3,50,4],[51,0,51,1],[54,0,54,2]]}
["Strengthening Career and Technical Education for the 21st Century Act "]
["(Perkins V)"]
["Quarterly Report of Expenditures"]
[]
["Grant Recipient:","Miles Community College",{"$f":"IF(B5=\"\",\"select from dropdown\",\"\")","v":""}]
["Grant Type:","Local Application",{"$f":"IF(B6=\"\",\"select from dropdown\",\"\")","v":""}]
{"$rows_left_out":51}
{"sheet":"List","index":9,"n_rows":17,"n_cols":18,"rows_kept":17,"cut":false,"hidden":true,"merged":[]}
[]
[null,"Yes",null,"Grant Type",null,"Grant Recipient",null,"Quarter Ended",null,"Grant Recipient",null,"Fiscal Year",null,"Award Name",null,"Quarter List",null,"Approval"]
[null,"No"]
[null,null,null,"Local Application",null,"Blackfeet Community College",null,"Q1 - 9/30",null,"Blackfeet Community College",null,"2025-2026",null,"Equity in Fire Science",null,"Quarter 1",null,"ML Rutherford"]
[null,null,null,"Non-Traditional",null,"City College",null,"Q2 - 12/31",null,"City College",null,"2026-2027",null,"Girls Representing in Trades",null,"Quarter 2",null,"Jacque Treaster"]
[null,null,null,"Rural Reserve",null,"Dawson Community College",null,"Q3 - 3/31",null,"Flathead Valley Community College",null,"2027-2028",null,"Women in Automotive",null,"Quarter 3",null,"Ciera Franks-Ongoy"]
{"$rows_left_out":11}